BrCris
type: Ontology
ontology prefix annot: brcris
label: BrCris Ontology
version info: 0.1
version info: 0.7

Community
type: Class
IAO_0000115: A community of people related by a common topic
description annot: A community of people and the entities related to them (Organizations, Publications, Projects, etc.) grouped according to a topic shared among them
display limit annot: -1
display rank annot: -1
hidden from display below role level annot: public
hidden from publish below role level annot: public
in class group: vitroClassGrouporganizations
prohibited from update below role level annot: public
subclass of: BFO_0000001
subclass of: BFO_0000002
subclass of: BFO_0000004
subclass of: Agent
subclass of: Group

DOAJ accepted after March 2014
type: DatatypeProperty
IAO_0000115: Whether the journal was accepted after March 2014 by DOAJ
hidden from display below role level annot: public
hidden from publish below role level annot: public
in property group annot: vitroPropertyGroupbibobscure
prohibited from update below role level annot: public
public description annot: Whether the journal was accepted after March 2014 by DOAJ
domain: Journal
range: string
sub property of: topDataProperty

DOAJ seal
type: DatatypeProperty
IAO_0000115: Whether the journal has the DOAJ seal. The DOAJ Seal is awarded to journals that demonstrate best practices in open access publishing.
hidden from display below role level annot: public
hidden from publish below role level annot: public
in property group annot: vitroPropertyGroupoverview
prohibited from update below role level annot: public
public description annot: Whether the journal has the DOAJ seal
domain: Journal
range: string
sub property of: topDataProperty

Dewey classification
type: DatatypeProperty
IAO_0000115: The journal Dewey classification
hidden from display below role level annot: public
hidden from publish below role level annot: public
in property group annot: vitroPropertyGroupoverview
prohibited from update below role level annot: public
public description annot: The journal Dewey classification
domain: Journal
range: string
sub property of: topDataProperty

Graduate Program
type: Class
IAO_0000115: A program offering graduate courses inside an educational institution
description annot: A program offering graduate courses inside an educational institution
display limit annot: -1
display rank annot: -1
hidden from display below role level annot: public
hidden from publish below role level annot: public
in class group: vitroClassGrouporganizations
prohibited from update below role level annot: public
subclass of: BFO_0000001
subclass of: BFO_0000002
subclass of: BFO_0000004
subclass of: Program
subclass of: Agent
subclass of: Organization

OA mandate mandated
type: DatatypeProperty
IAO_0000115: The Open Access mandate situation
hidden from display below role level annot: public
hidden from publish below role level annot: public
in property group annot: vitroPropertyGroupbibobscure
prohibited from update below role level annot: public
public description annot: The Open Access mandate situation
range: string
sub property of: topDataProperty

OA mandate URI
type: DatatypeProperty
IAO_0000115: The Open Access mandate URI
hidden from display below role level annot: public
hidden from publish below role level annot: public
in property group annot: vitroPropertyGroupbibobscure
prohibited from update below role level annot: public
public description annot: The Open Access mandate URI
range: anyURI
sub property of: topDataProperty

Referee Role
type: Class
IAO_0000115: The role assumed by a person participating in a thesis evaluation committee
description annot: The role assumed by a person participating in a thesis evaluation committee
display limit annot: -1
display rank annot: -1
hidden from display below role level annot: public
hidden from publish below role level annot: public
prohibited from update below role level annot: public
subclass of: BFO_0000001
subclass of: BFO_0000002
subclass of: BFO_0000017
subclass of: BFO_0000020
subclass of: BFO_0000023

access type
type: DatatypeProperty
IAO_0000112: Open access, subscription
IAO_0000115: The publication's access type
hidden from display below role level annot: public
hidden from publish below role level annot: public
in property group annot: vitroPropertyGroupbibobscure
prohibited from update below role level annot: public
public description annot: The publication's access type
domain: Document
range: string
sub property of: topDataProperty

aggregator
type: DatatypeProperty
IAO_0000115: The journal aggregator
hidden from display below role level annot: public
hidden from publish below role level annot: public
in property group annot: vitroPropertyGroupbibobscure
prohibited from update below role level annot: public
public description annot: The journal aggregator
domain: Journal
range: string
sub property of: topDataProperty

allow unrestricted reuse BOAI
type: DatatypeProperty
IAO_0000115: Whether the journal allows unrestricted reuse of its contents under the Budapest Open Access Initiative
hidden from display below role level annot: public
hidden from publish below role level annot: public
in property group annot: vitroPropertyGroupbibobscure
prohibited from update below role level annot: public
public description annot: Whether the journal allows unrestricted reuse of its contents under the Budapest Open Access Initiative
domain: Journal
range: string
sub property of: topDataProperty

APC amount
type: DatatypeProperty
IAO_0000115: The article processing charge for the journal
hidden from display below role level annot: public
hidden from publish below role level annot: public
in property group annot: vitroPropertyGroupbibobscure
prohibited from update below role level annot: public
public description annot: The article processing charge for the journal
domain: Journal
range: string
sub property of: hasMonetaryAmount
sub property of: topDataProperty

APC currency
type: DatatypeProperty
IAO_0000115: The currency for the journal article processing charge
hidden from display below role level annot: public
hidden from publish below role level annot: public
in property group annot: vitroPropertyGroupbibobscure
prohibited from update below role level annot: public
public description annot: The currency for the journal article processing charge
domain: Journal
range: string
sub property of: hasCurrency
sub property of: topDataProperty

associated degree date
type: AnnotationProperty
type: ObjectProperty
type: DatatypeProperty
IAO_0000115: For a thesis, the date when the associated degree was obtained
hidden from display below role level annot: public
hidden from publish below role level annot: public
in property group annot: vitroPropertyGroupoverview
offer create new option annot: true
prohibited from update below role level annot: public
public description annot: For a thesis, the date when the associated degree was obtained
select from existing annot: true
domain: Document
range: DateTimeValue
sub property of: dateTimeValue
sub property of: topObjectProperty

BDTD identifier
type: DatatypeProperty
IAO_0000115: The publication's identifier in the BDTD (Biblioteca Digital de Teses e Dissertações) platform
hidden from display below role level annot: public
hidden from publish below role level annot: public
in property group annot: vitroPropertyGroupidentifiers
prohibited from update below role level annot: public
public description annot: The publication's identifier in the BDTD (Biblioteca Digital de Teses e Dissertações) platform
domain: Document
range: string
sub property of: identifier
sub property of: topDataProperty

BrCris identifier
type: DatatypeProperty
IAO_0000115: The entity's BrCris identifier
hidden from display below role level annot: public
hidden from publish below role level annot: public
in property group annot: vitroPropertyGroupidentifiers
prohibited from update below role level annot: public
public description annot: The entity's BrCris identifier
range: string
sub property of: identifier
sub property of: topDataProperty

call abbreviation
type: DatatypeProperty
IAO_0000115: The abbreviation of the call for projects that contemplated the project.
hidden from display below role level annot: public
hidden from publish below role level annot: public
in property group annot: vitroPropertyGroupoverview
prohibited from update below role level annot: public
public description annot: The abbreviation of the call for projects that contemplated the project.
domain: Project
range: string
sub property of: abbreviation
sub property of: topDataProperty

call name
type: DatatypeProperty
IAO_0000115: The name of the call for projects that contemplated the project.
hidden from display below role level annot: public
hidden from publish below role level annot: public
in property group annot: vitroPropertyGroupoverview
prohibited from update below role level annot: public
public description annot: The name of the call for projects that contemplated the project.
sub property of: topDataProperty

Capes identifier
type: DatatypeProperty
IAO_0000115: The entity's identifier attributed by Capes
hidden from display below role level annot: public
hidden from publish below role level annot: public
in property group annot: vitroPropertyGroupidentifiers
prohibited from update below role level annot: public
public description annot: The entity's identifier attributed by Capes
range: string
sub property of: identifier
sub property of: topDataProperty

Ciencia id
type: DatatypeProperty
IAO_0000115: The person's ciencia id
hidden from display below role level annot: public
hidden from publish below role level annot: public
in property group annot: vitroPropertyGroupidentifiers
prohibited from update below role level annot: public
public description annot: The person's ciencia id
domain: Person
range: string
sub property of: identifier
sub property of: topDataProperty

circulation
type: DatatypeProperty
IAO_0000115: The journal circulation
hidden from display below role level annot: public
hidden from publish below role level annot: public
in property group annot: vitroPropertyGroupbibobscure
prohibited from update below role level annot: public
public description annot: The journal circulation
domain: Journal
range: string
sub property of: topDataProperty

citation name
type: DatatypeProperty
IAO_0000115: The person's citation name, as it appears in publications and bibliographic references
hidden from display below role level annot: public
hidden from publish below role level annot: public
in property group annot: vitroPropertyGroupaddress
prohibited from update below role level annot: public
public description annot: The person's citation name
domain: Name
range: string
sub property of: topDataProperty

CNPJ number
type: DatatypeProperty
IAO_0000115: The organization's CNPJ number
hidden from display below role level annot: public
hidden from publish below role level annot: public
in property group annot: vitroPropertyGroupidentifiers
prohibited from update below role level annot: public
public description annot: The organization's CNPJ number
domain: Organization
range: string
sub property of: identifier
sub property of: topDataProperty

CNPq identifier
type: DatatypeProperty
IAO_0000115: The identifier of the organization assigned by CNPq
hidden from display below role level annot: public
hidden from publish below role level annot: public
in property group annot: vitroPropertyGroupidentifiers
prohibited from update below role level annot: public
public description annot: The identifier of the organization assigned by CNPq
range: string
sub property of: identifier
sub property of: topDataProperty

compatibility
type: DatatypeProperty
IAO_0000115: The journal compatibility information
hidden from display below role level annot: public
hidden from publish below role level annot: public
in property group annot: vitroPropertyGroupbibobscure
prohibited from update below role level annot: public
public description annot: The journal compatibility information
domain: Journal
range: string
sub property of: topDataProperty

copyright without restrictions
type: DatatypeProperty
IAO_0000115: Whether the journal provides copyright without restrictions for articles
hidden from display below role level annot: public
hidden from publish below role level annot: public
in property group annot: vitroPropertyGroupbibobscure
prohibited from update below role level annot: public
public description annot: Whether the journal provides copyright without restrictions for articles
domain: Journal
range: string
sub property of: topDataProperty

country code
type: DatatypeProperty
IAO_0000115: The code of the country where the patent was filed.
hidden from display below role level annot: public
hidden from publish below role level annot: public
in property group annot: vitroPropertyGroupoverview
prohibited from update below role level annot: public
public description annot: The code of the country where the patent was filed.
domain: Patent
range: string
sub property of: topDataProperty

coverage
type: DatatypeProperty
IAO_0000115: The publication's coverage
hidden from display below role level annot: public
hidden from publish below role level annot: public
in property group annot: vitroPropertyGroupbibobscure
prohibited from update below role level annot: public
public description annot: The publication's coverage
domain: Document
range: string
sub property of: topDataProperty

CPC classification
type: DatatypeProperty
IAO_0000115: The classification of the patent according to the Cooperative Patent Classification.
hidden from display below role level annot: public
hidden from publish below role level annot: public
in property group annot: vitroPropertyGroupoverview
prohibited from update below role level annot: public
public description annot: The classification of the patent according to the Cooperative Patent Classification.
domain: Patent
range: string
sub property of: topDataProperty

CPF number
type: DatatypeProperty
type: FunctionalProperty
IAO_0000115: The person's CPF (Cadastro de Pessoa Física) number
hidden from display below role level annot: public
hidden from publish below role level annot: public
in property group annot: vitroPropertyGroupidentifiers
prohibited from update below role level annot: public
public description annot: The person's CPF (Cadastro de Pessoa Física) number
domain: Person
range: string
sub property of: identifier
sub property of: topDataProperty

most recent article date
type: ObjectProperty
type: DatatypeProperty
IAO_0000115: The date of the most recent article added to the journal
hidden from display below role level annot: public
hidden from publish below role level annot: public
in property group annot: vitroPropertyGroupbibobscure
offer create new option annot: true
prohibited from update below role level annot: public
public description annot: The date of the most recent article added to the journal
select from existing annot: true
domain: Journal
range: DateTimeValue
sub property of: dateTimeValue
sub property of: topObjectProperty

decimal classification
type: DatatypeProperty
IAO_0000115: The journal decimal classification
hidden from display below role level annot: public
hidden from publish below role level annot: public
in property group annot: vitroPropertyGroupoverview
prohibited from update below role level annot: public
public description annot: The journal decimal classification
domain: Journal
range: string
sub property of: topDataProperty

defense date
type: AnnotationProperty
type: ObjectProperty
type: DatatypeProperty
IAO_0000115: The date of defense for a thesis
hidden from display below role level annot: public
hidden from publish below role level annot: public
in property group annot: vitroPropertyGroupoverview
offer create new option annot: true
prohibited from update below role level annot: public
public description annot: The date of defense for a thesis
select from existing annot: true
domain: Document
range: DateTimeValue
sub property of: dateTimeValue
sub property of: topObjectProperty

degree level
type: DatatypeProperty
IAO_0000112: Undergraduate, master, doctoral
IAO_0000115: The course's degree level
hidden from display below role level annot: public
hidden from publish below role level annot: public
in property group annot: vitroPropertyGroupoverview
prohibited from update below role level annot: public
public description annot: The course's degree level
domain: Course
range: string
sub property of: topDataProperty

deposit policy directory
type: DatatypeProperty
IAO_0000115: The journal deposit policy directory
hidden from display below role level annot: public
hidden from publish below role level annot: public
in property group annot: vitroPropertyGroupbibobscure
prohibited from update below role level annot: public
public description annot: The journal deposit policy directory
domain: Journal
range: string
sub property of: topDataProperty

Diadorim access rights
type: DatatypeProperty
IAO_0000115: The journal access rights in the Diadorim platform
hidden from display below role level annot: public
hidden from publish below role level annot: public
in property group annot: vitroPropertyGroupbibobscure
prohibited from update below role level annot: public
public description annot: The journal access rights in the Diadorim platform
domain: Journal
range: string
sub property of: topDataProperty

Diadorim accessioned date
type: ObjectProperty
type: DatatypeProperty
IAO_0000115: The date the journal was added to the Diadorim platform
hidden from display below role level annot: public
hidden from publish below role level annot: public
in property group annot: vitroPropertyGroupbibobscure
offer create new option annot: true
prohibited from update below role level annot: public
public description annot: The date the journal was added to the Diadorim platform
select from existing annot: true
domain: Journal
range: DateTimeValue
sub property of: dateTimeValue
sub property of: topObjectProperty

Diadorim identifier
type: DatatypeProperty
IAO_0000115: The journal identifier in the Diadorim platform
hidden from display below role level annot: public
hidden from publish below role level annot: public
in property group annot: vitroPropertyGroupidentifiers
prohibited from update below role level annot: public
public description annot: The journal identifier in the Diadorim platform
domain: Journal
range: string
sub property of: identifier
sub property of: topDataProperty

digital archiving policy
type: DatatypeProperty
IAO_0000115: The journal digital archiving policy
hidden from display below role level annot: public
hidden from publish below role level annot: public
in property group annot: vitroPropertyGroupbibobscure
prohibited from update below role level annot: public
public description annot: The journal digital archiving policy
domain: Journal
range: string
sub property of: topDataProperty

distribution routes
type: DatatypeProperty
IAO_0000115: The journal distribution routes
hidden from display below role level annot: public
hidden from publish below role level annot: public
in property group annot: vitroPropertyGroupbibobscure
prohibited from update below role level annot: public
public description annot: The journal distribution routes
domain: Journal
range: string
sub property of: topDataProperty

distribution type
type: DatatypeProperty
IAO_0000115: The journal distribution type
hidden from display below role level annot: public
hidden from publish below role level annot: public
in property group annot: vitroPropertyGroupbibobscure
prohibited from update below role level annot: public
public description annot: The journal distribution type
domain: Journal
range: string
sub property of: topDataProperty

duration
type: DatatypeProperty
IAO_0000115: The grant's time duration
hidden from display below role level annot: public
hidden from publish below role level annot: public
prohibited from update below role level annot: public
public description annot: The grant's time duration
domain: Grant
range: string
sub property of: topDataProperty

embargoed time
type: DatatypeProperty
IAO_0000115: The embargo time for articles published in the journal
hidden from display below role level annot: public
hidden from publish below role level annot: public
in property group annot: vitroPropertyGroupbibobscure
prohibited from update below role level annot: public
public description annot: The embargo time for articles published in the journal
domain: Journal
range: string
sub property of: topDataProperty

Espacenet abstract
type: DatatypeProperty
IAO_0000115: The patent abstract in the Espacenet platform.
hidden from display below role level annot: public
hidden from publish below role level annot: public
in property group annot: vitroPropertyGroupoverview
prohibited from update below role level annot: public
public description annot: The patent abstract in the Espacenet platform.
domain: Patent
range: string
sub property of: abstract
sub property of: topDataProperty

Espacenet number
type: DatatypeProperty
IAO_0000115: The patent number in the Espacenet platform.
hidden from display below role level annot: public
hidden from publish below role level annot: public
in property group annot: vitroPropertyGroupidentifiers
prohibited from update below role level annot: public
public description annot: The patent number in the Espacenet platform.
domain: Patent
range: string
sub property of: identifier
sub property of: topDataProperty

Espacenet title
type: DatatypeProperty
IAO_0000115: The patent title in the Espacenet platform.
hidden from display below role level annot: public
hidden from publish below role level annot: public
in property group annot: vitroPropertyGroupoverview
prohibited from update below role level annot: public
public description annot: The patent title in the Espacenet platform.
domain: Patent
range: string
sub property of: topDataProperty

refereeing
type: ObjectProperty
IAO_0000115: A thesis being evaluated by a referee
hidden from display below role level annot: public
hidden from publish below role level annot: public
in property group annot: vitroPropertyGroupbibobscure
prohibited from update below role level annot: public
select from existing annot: true
domain: Document
range: Referee Role
sub property of: topObjectProperty
inverse of: evaluated publication

evaluated publication
type: ObjectProperty
type: DatatypeProperty
IAO_0000115: A thesis being evaluated by a referee
display limit annot: -1
hidden from display below role level annot: public
hidden from publish below role level annot: public
in property group annot: vitroPropertyGroupbibliographic
offer create new option annot: true
prohibited from update below role level annot: public
public description annot: A thesis being evaluated by a referee
select from existing annot: true
domain: Referee Role
range: Document
sub property of: topObjectProperty

evaluation area for
type: ObjectProperty
IAO_0000115: The knowledge area under which a graduate program is evaluated
hidden from display below role level annot: public
hidden from publish below role level annot: public
in property group annot: vitroPropertyGroupresearch
offer create new option annot: true
prohibited from update below role level annot: public
public description annot: Graduate programs evaluated under this knowledge area
select from existing annot: true
domain: Concept
range: Graduate Program
sub property of: conceptAssociatedWith
sub property of: topObjectProperty
inverse of: evaluation area

first year as open access
type: ObjectProperty
type: DatatypeProperty
IAO_0000115: The first year the journal was available as an open access resource
hidden from display below role level annot: public
hidden from publish below role level annot: public
in property group annot: vitroPropertyGroupbibobscure
offer create new option annot: true
prohibited from update below role level annot: public
public description annot: The first year the journal was available as an open access resource
select from existing annot: true
domain: Journal
range: DateTimeValue
sub property of: dateTimeValue
sub property of: topObjectProperty

full text formats
type: DatatypeProperty
IAO_0000115: The format of full texts provided by this journal
hidden from display below role level annot: public
hidden from publish below role level annot: public
in property group annot: vitroPropertyGroupbibobscure
prohibited from update below role level annot: public
public description annot: The format of full texts provided by this journal
domain: Journal
range: string
sub property of: topDataProperty

FundRef identifier
type: DatatypeProperty
IAO_0000115: The identifier of the organization in the FundRef funders list
hidden from display below role level annot: public
hidden from publish below role level annot: public
in property group annot: vitroPropertyGroupidentifiers
prohibited from update below role level annot: public
public description annot: The identifier of the organization in the FundRef funders list
domain: Organization
range: string
sub property of: identifier
sub property of: topDataProperty

geographic distribution
type: DatatypeProperty
IAO_0000115: The journal geographic distribution
hidden from display below role level annot: public
hidden from publish below role level annot: public
in property group annot: vitroPropertyGroupbibobscure
prohibited from update below role level annot: public
public description annot: The journal geographic distribution
domain: Journal
range: string
sub property of: topDataProperty

institution
type: ObjectProperty
IAO_0000115: The graduate programs offered by an organization, usually an university
display limit annot: -1
hidden from display below role level annot: public
hidden from publish below role level annot: public
in property group annot: vitroPropertyGroupoverview
prohibited from update below role level annot: public
select from existing annot: true
domain: Graduate Program
range: Organization
sub property of: BFO_0000050
sub property of: topObjectProperty

GRID identifier
type: DatatypeProperty
IAO_0000115: The identifier of the organization in the Global Research Identifier Database (GRID)
hidden from display below role level annot: public
hidden from publish below role level annot: public
in property group annot: vitroPropertyGroupidentifiers
prohibited from update below role level annot: public
public description annot: The identifier of the organization in the Global Research Identifier Database (GRID)
domain: Organization
range: string
sub property of: identifier
sub property of: topDataProperty

handle identifier
type: DatatypeProperty
IAO_0000115: The publication's handle identifier
hidden from display below role level annot: public
hidden from publish below role level annot: public
in property group annot: vitroPropertyGroupidentifiers
prohibited from update below role level annot: public
public description annot: The publication's handle identifier
domain: Document
range: string
sub property of: identifier
sub property of: topDataProperty

birth location
type: ObjectProperty
type: DatatypeProperty
IAO_0000115: A person's birth location (country, state, and city)
hidden from display below role level annot: public
hidden from publish below role level annot: public
in property group annot: vitroPropertyGroupaddress
offer create new option annot: true
prohibited from update below role level annot: public
public description annot: A person's birth location
select from existing annot: true
domain: Individual
range: Location
sub property of: topObjectProperty

has concept
type: ObjectProperty
IAO_0000115: The concepts making up a scheme.
display rank annot: 10
hidden from display below role level annot: public
hidden from publish below role level annot: public
in property group annot: vitroPropertyGroupoverview
prohibited from update below role level annot: public
public description annot: The concepts making up a scheme.
select from existing annot: true
domain: ConceptScheme
range: Concept
sub property of: topObjectProperty
inverse of: inScheme

evaluation area
type: ObjectProperty
IAO_0000115: The knowledge area under which a graduate program is evaluated
display limit annot: -1
hidden from display below role level annot: public
hidden from publish below role level annot: public
in property group annot: vitroPropertyGroupresearch
offer create new option annot: true
prohibited from update below role level annot: public
public description annot: The knowledge area under which a graduate program is evaluated
select from existing annot: true
domain: Graduate Program
range: Concept
sub property of: hasAssociatedConcept
sub property of: topObjectProperty

graduate programs
type: ObjectProperty
IAO_0000115: The graduate programs offered by an organization, usually an university
hidden from display below role level annot: public
hidden from publish below role level annot: public
in property group annot: vitroPropertyGroupoutreach
offer create new option annot: true
prohibited from update below role level annot: public
public description annot: The graduate programs offered by an organization, usually an university
select from existing annot: true
domain: Organization
range: Graduate Program
sub property of: BFO_0000051
sub property of: topObjectProperty
inverse of: institution

projects
type: ObjectProperty
type: DatatypeProperty
IAO_0000115: The projects executed by an organization
display limit annot: -1
hidden from display below role level annot: public
hidden from publish below role level annot: public
in property group annot: vitroPropertyGroupresearch
offer create new option annot: true
prohibited from update below role level annot: public
public description annot: The projects executed by an organization
select from existing annot: true
domain: Organization
range: Project
sub property of: topObjectProperty
inverse of: executed by

publications
type: ObjectProperty
type: DatatypeProperty
IAO_0000115: Publications related to a Course or Graduate Program
display limit annot: -1
hidden from display below role level annot: public
hidden from publish below role level annot: public
in property group annot: vitroPropertyGroupbibliographic
offer create new option annot: true
prohibited from update below role level annot: public
public description annot: Publications related to a Course or Graduate Program
select from existing annot: true
range: Document
sub property of: topObjectProperty

Inep identifier
type: DatatypeProperty
IAO_0000115: The identifier of the organization assigned by the Instituto Nacional de Estudos e Pesquisas Educacionais Anísio Teixeira (Inep)
hidden from display below role level annot: public
hidden from publish below role level annot: public
in property group annot: vitroPropertyGroupidentifiers
prohibited from update below role level annot: public
public description annot: The identifier of the organization assigned by the Instituto Nacional de Estudos e Pesquisas Educacionais Anísio Teixeira (Inep)
range: string
sub property of: identifier
sub property of: topDataProperty

IPC classification
type: DatatypeProperty
IAO_0000115: The classification of the patent according to the International Patent Classification.
hidden from display below role level annot: public
hidden from publish below role level annot: public
in property group annot: vitroPropertyGroupoverview
prohibited from update below role level annot: public
public description annot: The classification of the patent according to the International Patent Classification.
domain: Patent
range: string
sub property of: topDataProperty

ISI number
type: DatatypeProperty
IAO_0000115: The publication's identifier in the ISI (International Scientific Indexing) platform
hidden from display below role level annot: public
hidden from publish below role level annot: public
in property group annot: vitroPropertyGroupidentifiers
prohibited from update below role level annot: public
public description annot: The publication's identifier in the ISI (International Scientific Indexing) platform
domain: Document
range: string
sub property of: identifier
sub property of: topDataProperty

ISNI
type: DatatypeProperty
IAO_0000115: The organization's International Standard Name Identifier (ISNI)
hidden from display below role level annot: public
hidden from publish below role level annot: public
in property group annot: vitroPropertyGroupidentifiers
prohibited from update below role level annot: public
public description annot: The organization's International Standard Name Identifier (ISNI)
domain: Organization
range: string
sub property of: identifier
sub property of: topDataProperty

ISSN-L
type: DatatypeProperty
IAO_0000115: The journal linking ISSN. The linking ISSN, or ISSN-L, is a specific ISSN that groups the different media of the same serial publication. A single ISSN-L is designated for all media of a serial publication, irrespective of how many there are. A serial publication is associated with a single ISSN-L.
hidden from display below role level annot: public
hidden from publish below role level annot: public
in property group annot: vitroPropertyGroupidentifiers
prohibited from update below role level annot: public
public description annot: The journal linking ISSN (ISSN-L)
domain: Journal
range: string
sub property of: identifier
sub property of: topDataProperty

journal status
type: DatatypeProperty
IAO_0000115: The journal status
hidden from display below role level annot: public
hidden from publish below role level annot: public
in property group annot: vitroPropertyGroupoverview
prohibited from update below role level annot: public
public description annot: The journal status
domain: Journal
range: string
sub property of: topDataProperty

Latindex identifier
type: DatatypeProperty
IAO_0000115: The journal identifier in the Latindex platform
hidden from display below role level annot: public
hidden from publish below role level annot: public
in property group annot: vitroPropertyGroupidentifiers
prohibited from update below role level annot: public
public description annot: The journal identifier in the Latindex platform
domain: Journal
range: string
sub property of: identifier
sub property of: topDataProperty

Lattes abstract
type: DatatypeProperty
IAO_0000115: The patent abstract in the Lattes platform.
hidden from display below role level annot: public
hidden from publish below role level annot: public
in property group annot: vitroPropertyGroupoverview
prohibited from update below role level annot: public
public description annot: The patent abstract in the Lattes platform.
domain: Patent
range: string
sub property of: abstract
sub property of: topDataProperty

Lattes identifier
type: DatatypeProperty
IAO_0000115: The person's identifier in the Lattes platform
hidden from display below role level annot: public
hidden from publish below role level annot: public
in property group annot: vitroPropertyGroupidentifiers
prohibited from update below role level annot: public
public description annot: The person's identifier in the Lattes platform
domain: Person
range: string
sub property of: identifier
sub property of: topDataProperty

Lattes number
type: DatatypeProperty
IAO_0000115: The patent number in the Lattes platform.
hidden from display below role level annot: public
hidden from publish below role level annot: public
in property group annot: vitroPropertyGroupidentifiers
prohibited from update below role level annot: public
public description annot: The patent number in the Lattes platform.
domain: Patent
range: string
sub property of: identifier
sub property of: topDataProperty

Lattes short identifier
type: DatatypeProperty
IAO_0000115: The person's short identifier in the Lattes platform
hidden from display below role level annot: public
hidden from publish below role level annot: public
in property group annot: vitroPropertyGroupidentifiers
prohibited from update below role level annot: public
public description annot: The person's short identifier in the Lattes platform
domain: Person
range: string
sub property of: identifier
sub property of: topDataProperty

Lattes title
type: DatatypeProperty
IAO_0000115: The patent title in the Lattes platform.
hidden from display below role level annot: public
hidden from publish below role level annot: public
in property group annot: vitroPropertyGroupoverview
prohibited from update below role level annot: public
public description annot: The patent title in the Lattes platform.
domain: Patent
range: string
sub property of: topDataProperty

license attributes
type: DatatypeProperty
IAO_0000115: The journal license attributes
hidden from display below role level annot: public
hidden from publish below role level annot: public
in property group annot: vitroPropertyGroupbibobscure
prohibited from update below role level annot: public
public description annot: The journal license attributes
domain: Journal
range: string
sub property of: topDataProperty

MEC Identifier
type: DatatypeProperty
IAO_0000115: The identifier of the organization assigned by the Brazilian Ministry of Education and Culture (MEC)
hidden from display below role level annot: public
hidden from publish below role level annot: public
in property group annot: vitroPropertyGroupidentifiers
prohibited from update below role level annot: public
public description annot: The identifier of the organization assigned by the Brazilian Ministry of Education and Culture (MEC)
range: string
sub property of: identifier
sub property of: topDataProperty

modality code
type: DatatypeProperty
IAO_0000115: The code for the project's modality according to the CNPq classification
hidden from display below role level annot: public
hidden from publish below role level annot: public
in property group annot: vitroPropertyGroupoverview
prohibited from update below role level annot: public
public description annot: The code for the project's modality according to the CNPq classification
domain: Project
range: string
sub property of: topDataProperty

modality name
type: DatatypeProperty
IAO_0000115: The name of the project's modality according to the CNPq classification.
hidden from display below role level annot: public
hidden from publish below role level annot: public
in property group annot: vitroPropertyGroupoverview
prohibited from update below role level annot: public
public description annot: The name of the project's modality according to the CNPq classification.
domain: Project
range: string
sub property of: topDataProperty

national archiving
type: DatatypeProperty
IAO_0000115: The journal national archiving information
hidden from display below role level annot: public
hidden from publish below role level annot: public
in property group annot: vitroPropertyGroupbibobscure
prohibited from update below role level annot: public
public description annot: The journal national archiving information
domain: Journal
range: string
sub property of: topDataProperty

neighborhood
type: DatatypeProperty
IAO_0000115: The address neighborhood
hidden from display below role level annot: public
hidden from publish below role level annot: public
in property group annot: vitroPropertyGrouplocation
prohibited from update below role level annot: public
public description annot: The address neighborhood
domain: Address
range: string
sub property of: topDataProperty

notes
type: DatatypeProperty
IAO_0000115: Any additional notes on the resource
hidden from display below role level annot: public
hidden from publish below role level annot: public
in property group annot: vitroPropertyGroupbibobscure
prohibited from update below role level annot: public
public description annot: Any additional notes on the resource
range: string
sub property of: topDataProperty

OAI identifier
type: DatatypeProperty
IAO_0000115: The Open Archives Initiative identifier for the journal
hidden from display below role level annot: public
hidden from publish below role level annot: public
in property group annot: vitroPropertyGroupidentifiers
prohibited from update below role level annot: public
public description annot: The Open Archives Initiative identifier for the journal
domain: Journal
range: string
sub property of: identifier
sub property of: topDataProperty

OAI-PMH url
type: DatatypeProperty
IAO_0000115: The resource OAI-PMH protocol URL
hidden from display below role level annot: public
hidden from publish below role level annot: public
in property group annot: vitroPropertyGroupbibobscure
prohibited from update below role level annot: public
public description annot: The resource OAI-PMH protocol URL
range: anyURI
sub property of: topDataProperty
sub property of: url

Oasisbr identifier
type: DatatypeProperty
IAO_0000115: The publication's identifier in the OasisBr platform
hidden from display below role level annot: public
hidden from publish below role level annot: public
in property group annot: vitroPropertyGroupidentifiers
prohibited from update below role level annot: public
public description annot: The publication's identifier in the OasisBr platform
domain: Document
range: string
sub property of: identifier
sub property of: topDataProperty

old title
type: DatatypeProperty
IAO_0000115: The journal former title, in case it has changed over time
hidden from display below role level annot: public
hidden from publish below role level annot: public
in property group annot: vitroPropertyGroupbibobscure
prohibited from update below role level annot: public
public description annot: The journal former title, in case it has changed over time
domain: Journal
range: string
sub property of: topDataProperty

OpenDOAR identifier
type: DatatypeProperty
IAO_0000115: The journal identifier in the OpenDOAR platform
hidden from display below role level annot: public
hidden from publish below role level annot: public
in property group annot: vitroPropertyGroupidentifiers
prohibited from update below role level annot: public
public description annot: The journal identifier in the OpenDOAR platform
domain: Journal
range: string
sub property of: identifier
sub property of: topDataProperty

nature
type: DatatypeProperty
IAO_0000115: The organization's nature
hidden from display below role level annot: public
hidden from publish below role level annot: public
in property group annot: vitroPropertyGroupoverview
prohibited from update below role level annot: public
public description annot: The organization's nature
domain: Organization
range: string
sub property of: topDataProperty

OrgRef identifier
type: DatatypeProperty
IAO_0000115: The identifier of the organization in the OrgRef database
hidden from display below role level annot: public
hidden from publish below role level annot: public
in property group annot: vitroPropertyGroupidentifiers
prohibited from update below role level annot: public
public description annot: The identifier of the organization in the OrgRef database
domain: Organization
range: string
sub property of: identifier
sub property of: topDataProperty

executed by
type: ObjectProperty
IAO_0000115: The projects executed by an organization
hidden from display below role level annot: public
hidden from publish below role level annot: public
in property group annot: vitroPropertyGroupaffiliation
prohibited from update below role level annot: public
select from existing annot: true
domain: Project
range: Organization
sub property of: topObjectProperty

pos-print deposit
type: DatatypeProperty
IAO_0000115: The journal pos-print deposit
hidden from display below role level annot: public
hidden from publish below role level annot: public
in property group annot: vitroPropertyGroupbibobscure
prohibited from update below role level annot: public
public description annot: The journal pos-print deposit
domain: Journal
range: string
sub property of: topDataProperty

process number
type: DatatypeProperty
IAO_0000115: The number that identifies the process associated with the project, opened and managed by the funding agency that funds it.
hidden from display below role level annot: public
hidden from publish below role level annot: public
in property group annot: vitroPropertyGroupoverview
prohibited from update below role level annot: public
public description annot: The number that identifies the process associated with the project, opened and managed by the funding agency that funds it.
domain: Project
range: string
sub property of: identifier
sub property of: topDataProperty

produced at
type: ObjectProperty
IAO_0000115: Publications related to a Course or Graduate Program
hidden from display below role level annot: public
hidden from publish below role level annot: public
in property group annot: vitroPropertyGroupoverview
offer create new option annot: true
prohibited from update below role level annot: public
select from existing annot: true
domain: Document
sub property of: topObjectProperty
inverse of: publications

project status
type: DatatypeProperty
IAO_0000115: The status of the project
hidden from display below role level annot: public
hidden from publish below role level annot: public
in property group annot: vitroPropertyGroupoverview
prohibited from update below role level annot: public
public description annot: The status of the project
domain: Project
range: string
sub property of: topDataProperty

publication format
type: DatatypeProperty
IAO_0000115: The journal publication format
hidden from display below role level annot: public
hidden from publish below role level annot: public
in property group annot: vitroPropertyGroupbibobscure
prohibited from update below role level annot: public
public description annot: The journal publication format
domain: Journal
range: string
sub property of: topDataProperty

publication frequency
type: DatatypeProperty
IAO_0000115: The journal publication periodicity
hidden from display below role level annot: public
hidden from publish below role level annot: public
in property group annot: vitroPropertyGroupoverview
prohibited from update below role level annot: public
public description annot: The journal publication periodicity
domain: Journal
range: string
sub property of: topDataProperty

publication rights without restrictions
type: DatatypeProperty
IAO_0000115: Whether the journal provides publication rights without restrictions for articles
hidden from display below role level annot: public
hidden from publish below role level annot: public
in property group annot: vitroPropertyGroupbibobscure
prohibited from update below role level annot: public
public description annot: Whether the journal provides publication rights without restrictions for articles
domain: Journal
range: string
sub property of: topDataProperty

advised by
type: AnnotationProperty
type: ObjectProperty
type: DatatypeProperty
IAO_0000115: A master or doctoral thesis resulting from an advising relationship
hidden from display below role level annot: public
hidden from publish below role level annot: public
in property group annot: vitroPropertyGroupoverview
offer create new option annot: true
prohibited from update below role level annot: public
public description annot: A master or doctoral thesis resulting from an advising relationship
select from existing annot: true
domain: Document
range: AdvisingRelationship
sub property of: topObjectProperty

review process
type: DatatypeProperty
IAO_0000115: The review process for the articles submitted to this journal
hidden from display below role level annot: public
hidden from publish below role level annot: public
in property group annot: vitroPropertyGroupbibobscure
prohibited from update below role level annot: public
public description annot: The review process for the articles submitted to this journal
domain: Journal
range: string
sub property of: topDataProperty

rights time
type: DatatypeProperty
IAO_0000115: The rights time for articles published in this journal
hidden from display below role level annot: public
hidden from publish below role level annot: public
in property group annot: vitroPropertyGroupbibobscure
prohibited from update below role level annot: public
public description annot: The rights time for articles published in this journal
domain: Journal
range: string
sub property of: topDataProperty

ROR identifier
type: DatatypeProperty
IAO_0000115: The identifier of the organization in the Research Organization Registry (ROR) project
hidden from display below role level annot: public
hidden from publish below role level annot: public
in property group annot: vitroPropertyGroupidentifiers
prohibited from update below role level annot: public
public description annot: The identifier of the organization in the Research Organization Registry (ROR) project
domain: Organization
range: string
sub property of: identifier
sub property of: topDataProperty

identifier in scheme
type: DatatypeProperty
IAO_0000115: The identifier of the concept inside the scheme it belongs to.
hidden from display below role level annot: public
hidden from publish below role level annot: public
in property group annot: vitroPropertyGroupidentifiers
prohibited from update below role level annot: public
public description annot: The identifier of the concept inside the scheme it belongs to.
domain: Concept
range: string
sub property of: topDataProperty

SCP number
type: DatatypeProperty
IAO_0000115: The publication's Scopus number
hidden from display below role level annot: public
hidden from publish below role level annot: public
in property group annot: vitroPropertyGroupidentifiers
prohibited from update below role level annot: public
public description annot: The publication's Scopus number
domain: Document
range: string
sub property of: identifier
sub property of: topDataProperty

series
type: DatatypeProperty
IAO_0000115: The publication's series
hidden from display below role level annot: public
hidden from publish below role level annot: public
in property group annot: vitroPropertyGroupbibobscure
prohibited from update below role level annot: public
public description annot: The publication's series
domain: Document
range: string
sub property of: topDataProperty

source type
type: DatatypeProperty
IAO_0000115: The service's source type
hidden from display below role level annot: public
hidden from publish below role level annot: public
in property group annot: vitroPropertyGroupoverview
prohibited from update below role level annot: public
public description annot: The service's source type
domain: ERO_0000005
range: string
sub property of: type
sub property of: topDataProperty

submission amount
type: DatatypeProperty
IAO_0000115: The amount charged by the journal for article submission
hidden from display below role level annot: public
hidden from publish below role level annot: public
in property group annot: vitroPropertyGroupbibobscure
prohibited from update below role level annot: public
public description annot: The amount charged by the journal for article submission
domain: Journal
range: string
sub property of: hasMonetaryAmount
sub property of: topDataProperty

submission url
type: DatatypeProperty
IAO_0000115: The journal article submission URL
hidden from display below role level annot: public
hidden from publish below role level annot: public
in property group annot: vitroPropertyGroupoverview
prohibited from update below role level annot: public
public description annot: The journal article submission URL
domain: Journal
range: anyURI
sub property of: topDataProperty
sub property of: url

subtitle
type: DatatypeProperty
IAO_0000115: The publication's subtitle
hidden from display below role level annot: public
hidden from publish below role level annot: public
in property group annot: vitroPropertyGroupoverview
prohibited from update below role level annot: public
public description annot: The publication's subtitle
domain: Document
range: string
sub property of: topDataProperty

resulting thesis
type: AnnotationProperty
type: ObjectProperty
type: DatatypeProperty
IAO_0000115: A master or doctoral thesis resulting from an advising relationship
display limit annot: -1
hidden from display below role level annot: public
hidden from publish below role level annot: public
in property group annot: vitroPropertyGroupbibliographic
offer create new option annot: true
prohibited from update below role level annot: public
public description annot: A master or doctoral thesis resulting from an advising relationship
select from existing annot: true
domain: AdvisingRelationship
range: Document
sub property of: topObjectProperty
inverse of: advised by

time to publication
type: DatatypeProperty
IAO_0000115: The mean time from submission to publication in the journal
hidden from display below role level annot: public
hidden from publish below role level annot: public
in property group annot: vitroPropertyGroupbibobscure
prohibited from update below role level annot: public
public description annot: The mean time from submission to publication in the journal
domain: Journal
range: string
sub property of: topDataProperty

total recorded articles
type: DatatypeProperty
IAO_0000115: The journal total number of recorded articles
hidden from display below role level annot: public
hidden from publish below role level annot: public
in property group annot: vitroPropertyGroupoverview
prohibited from update below role level annot: public
public description annot: The journal total number of recorded articles
domain: Journal
range: integer
sub property of: topDataProperty

Ulrichsweb identifier
type: DatatypeProperty
IAO_0000115: The journal identifier in the Ulrichsweb platform
hidden from display below role level annot: public
hidden from publish below role level annot: public
in property group annot: vitroPropertyGroupidentifiers
prohibited from update below role level annot: public
public description annot: The journal identifier in the Ulrichsweb platform
domain: Journal
range: string
sub property of: identifier
sub property of: topDataProperty

URI identifier
type: DatatypeProperty
IAO_0000115: The URI as an identifier for the journal
hidden from display below role level annot: public
hidden from publish below role level annot: public
in property group annot: vitroPropertyGroupidentifiers
prohibited from update below role level annot: public
public description annot: The URI as an identifier for the journal
domain: Journal
range: string
sub property of: identifier
sub property of: topDataProperty

uses
type: DatatypeProperty
hidden from display below role level annot: public
hidden from publish below role level annot: public
in property group annot: vitroPropertyGroupresearch
prohibited from update below role level annot: public
domain: Project
range: string
sub property of: topDataProperty

Wikidata identifier
type: DatatypeProperty
IAO_0000115: The identifier of the organization in the Wikidata platform
hidden from display below role level annot: public
hidden from publish below role level annot: public
in property group annot: vitroPropertyGroupidentifiers
prohibited from update below role level annot: public
public description annot: The identifier of the organization in the Wikidata platform
domain: Organization
range: string
sub property of: identifier
sub property of: topDataProperty