BrCris
type: Ontology
ontology prefix annot: brcris
label: BrCris Ontology
version info: 0.1
version info: 0.7

associated degree date
type: AnnotationProperty
domain: Document
type: ObjectProperty
sub property of: dateTimeValue
sub property of: topObjectProperty
type: DatatypeProperty
range: DateTimeValue
IAO_0000115: For a thesis, the date when the associated degree was obtained
hidden from display below role level annot: public
hidden from publish below role level annot: public
in property group annot: vitroPropertyGroupoverview
offer create new option annot: true
prohibited from update below role level annot: public
public description annot: For a thesis, the date when the associated degree was obtained
select from existing annot: true

defense date
type: AnnotationProperty
domain: Document
type: ObjectProperty
sub property of: dateTimeValue
sub property of: topObjectProperty
type: DatatypeProperty
range: DateTimeValue
IAO_0000115: The date of defense for a thesis
hidden from display below role level annot: public
hidden from publish below role level annot: public
in property group annot: vitroPropertyGroupoverview
offer create new option annot: true
prohibited from update below role level annot: public
public description annot: The date of defense for a thesis
select from existing annot: true

advised by
type: AnnotationProperty
domain: Document
type: ObjectProperty
sub property of: topObjectProperty
type: DatatypeProperty
range: AdvisingRelationship
IAO_0000115: A master or doctoral thesis resulting from an advising relationship
hidden from display below role level annot: public
hidden from publish below role level annot: public
in property group annot: vitroPropertyGroupoverview
offer create new option annot: true
prohibited from update below role level annot: public
public description annot: A master or doctoral thesis resulting from an advising relationship
select from existing annot: true

resulting thesis
type: AnnotationProperty
domain: AdvisingRelationship
type: ObjectProperty
sub property of: topObjectProperty
inverse of: advised by
type: DatatypeProperty
range: Document
IAO_0000115: A master or doctoral thesis resulting from an advising relationship
display limit annot: -1
hidden from display below role level annot: public
hidden from publish below role level annot: public
in property group annot: vitroPropertyGroupbibliographic
offer create new option annot: true
prohibited from update below role level annot: public
public description annot: A master or doctoral thesis resulting from an advising relationship
select from existing annot: true

most recent article date
type: ObjectProperty
sub property of: dateTimeValue
sub property of: topObjectProperty
domain: Journal
type: DatatypeProperty
range: DateTimeValue
IAO_0000115: The date of the most recent article added to the journal
hidden from display below role level annot: public
hidden from publish below role level annot: public
in property group annot: vitroPropertyGroupbibobscure
offer create new option annot: true
prohibited from update below role level annot: public
public description annot: The date of the most recent article added to the journal
select from existing annot: true

Diadorim accessioned date
type: ObjectProperty
sub property of: dateTimeValue
sub property of: topObjectProperty
domain: Journal
type: DatatypeProperty
range: DateTimeValue
IAO_0000115: The date the journal was added to the Diadorim platform
hidden from display below role level annot: public
hidden from publish below role level annot: public
in property group annot: vitroPropertyGroupbibobscure
offer create new option annot: true
prohibited from update below role level annot: public
public description annot: The date the journal was added to the Diadorim platform
select from existing annot: true

refereeing
type: ObjectProperty
sub property of: topObjectProperty
inverse of: evaluated publication
domain: Document
range: Referee Role
IAO_0000115: A thesis being evaluated by a referee
hidden from display below role level annot: public
hidden from publish below role level annot: public
in property group annot: vitroPropertyGroupbibobscure
prohibited from update below role level annot: public
select from existing annot: true

evaluated publication
type: ObjectProperty
sub property of: topObjectProperty
domain: Referee Role
type: DatatypeProperty
range: Document
IAO_0000115: A thesis being evaluated by a referee
display limit annot: -1
hidden from display below role level annot: public
hidden from publish below role level annot: public
in property group annot: vitroPropertyGroupbibliographic
offer create new option annot: true
prohibited from update below role level annot: public
public description annot: A thesis being evaluated by a referee
select from existing annot: true

evaluation area for
type: ObjectProperty
sub property of: conceptAssociatedWith
sub property of: topObjectProperty
inverse of: evaluation area
domain: Concept
range: Graduate Program
IAO_0000115: The knowledge area under which a graduate program is evaluated
hidden from display below role level annot: public
hidden from publish below role level annot: public
in property group annot: vitroPropertyGroupresearch
offer create new option annot: true
prohibited from update below role level annot: public
public description annot: Graduate programs evaluated under this knowledge area
select from existing annot: true

first year as open access
type: ObjectProperty
sub property of: dateTimeValue
sub property of: topObjectProperty
domain: Journal
type: DatatypeProperty
range: DateTimeValue
IAO_0000115: The first year the journal was available as an open access resource
hidden from display below role level annot: public
hidden from publish below role level annot: public
in property group annot: vitroPropertyGroupbibobscure
offer create new option annot: true
prohibited from update below role level annot: public
public description annot: The first year the journal was available as an open access resource
select from existing annot: true

institution
type: ObjectProperty
sub property of: BFO_0000050
sub property of: topObjectProperty
domain: Graduate Program
range: Organization
IAO_0000115: The graduate programs offered by an organization, usually an university
display limit annot: -1
hidden from display below role level annot: public
hidden from publish below role level annot: public
in property group annot: vitroPropertyGroupoverview
prohibited from update below role level annot: public
select from existing annot: true

birth location
type: ObjectProperty
sub property of: topObjectProperty
domain: Individual
type: DatatypeProperty
range: Location
IAO_0000115: A person's birth location (country, state, and city)
hidden from display below role level annot: public
hidden from publish below role level annot: public
in property group annot: vitroPropertyGroupaddress
offer create new option annot: true
prohibited from update below role level annot: public
public description annot: A person's birth location
select from existing annot: true

has concept
type: ObjectProperty
sub property of: topObjectProperty
inverse of: inScheme
domain: ConceptScheme
range: Concept
IAO_0000115: The concepts making up a scheme.
display rank annot: 10
hidden from display below role level annot: public
hidden from publish below role level annot: public
in property group annot: vitroPropertyGroupoverview
prohibited from update below role level annot: public
public description annot: The concepts making up a scheme.
select from existing annot: true

evaluation area
type: ObjectProperty
sub property of: hasAssociatedConcept
sub property of: topObjectProperty
domain: Graduate Program
range: Concept
IAO_0000115: The knowledge area under which a graduate program is evaluated
display limit annot: -1
hidden from display below role level annot: public
hidden from publish below role level annot: public
in property group annot: vitroPropertyGroupresearch
offer create new option annot: true
prohibited from update below role level annot: public
public description annot: The knowledge area under which a graduate program is evaluated
select from existing annot: true

graduate programs
type: ObjectProperty
sub property of: BFO_0000051
sub property of: topObjectProperty
inverse of: institution
domain: Organization
range: Graduate Program
IAO_0000115: The graduate programs offered by an organization, usually an university
hidden from display below role level annot: public
hidden from publish below role level annot: public
in property group annot: vitroPropertyGroupoutreach
offer create new option annot: true
prohibited from update below role level annot: public
public description annot: The graduate programs offered by an organization, usually an university
select from existing annot: true

projects
type: ObjectProperty
sub property of: topObjectProperty
inverse of: executed by
domain: Organization
type: DatatypeProperty
range: Project
IAO_0000115: The projects executed by an organization
display limit annot: -1
hidden from display below role level annot: public
hidden from publish below role level annot: public
in property group annot: vitroPropertyGroupresearch
offer create new option annot: true
prohibited from update below role level annot: public
public description annot: The projects executed by an organization
select from existing annot: true

publications
type: ObjectProperty
sub property of: topObjectProperty
type: DatatypeProperty
range: Document
IAO_0000115: Publications related to a Course or Graduate Program
display limit annot: -1
hidden from display below role level annot: public
hidden from publish below role level annot: public
in property group annot: vitroPropertyGroupbibliographic
offer create new option annot: true
prohibited from update below role level annot: public
public description annot: Publications related to a Course or Graduate Program
select from existing annot: true

executed by
type: ObjectProperty
sub property of: topObjectProperty
domain: Project
range: Organization
IAO_0000115: The projects executed by an organization
hidden from display below role level annot: public
hidden from publish below role level annot: public
in property group annot: vitroPropertyGroupaffiliation
prohibited from update below role level annot: public
select from existing annot: true

produced at
type: ObjectProperty
sub property of: topObjectProperty
inverse of: publications
domain: Document
IAO_0000115: Publications related to a Course or Graduate Program
hidden from display below role level annot: public
hidden from publish below role level annot: public
in property group annot: vitroPropertyGroupoverview
offer create new option annot: true
prohibited from update below role level annot: public
select from existing annot: true

DOAJ accepted after March 2014
type: DatatypeProperty
sub property of: topDataProperty
domain: Journal
range: string
IAO_0000115: Whether the journal was accepted after March 2014 by DOAJ
hidden from display below role level annot: public
hidden from publish below role level annot: public
in property group annot: vitroPropertyGroupbibobscure
prohibited from update below role level annot: public
public description annot: Whether the journal was accepted after March 2014 by DOAJ

DOAJ seal
type: DatatypeProperty
sub property of: topDataProperty
domain: Journal
range: string
IAO_0000115: Whether the journal has the DOAJ seal. The DOAJ Seal is awarded to journals that demonstrate best practices in open access publishing.
hidden from display below role level annot: public
hidden from publish below role level annot: public
in property group annot: vitroPropertyGroupoverview
prohibited from update below role level annot: public
public description annot: Whether the journal has the DOAJ seal

Dewey classification
type: DatatypeProperty
sub property of: topDataProperty
domain: Journal
range: string
IAO_0000115: The journal Dewey classification
hidden from display below role level annot: public
hidden from publish below role level annot: public
in property group annot: vitroPropertyGroupoverview
prohibited from update below role level annot: public
public description annot: The journal Dewey classification

OA mandate mandated
type: DatatypeProperty
sub property of: topDataProperty
range: string
IAO_0000115: The Open Access mandate situation
hidden from display below role level annot: public
hidden from publish below role level annot: public
in property group annot: vitroPropertyGroupbibobscure
prohibited from update below role level annot: public
public description annot: The Open Access mandate situation

OA mandate URI
type: DatatypeProperty
sub property of: topDataProperty
range: anyURI
IAO_0000115: The Open Access mandate URI
hidden from display below role level annot: public
hidden from publish below role level annot: public
in property group annot: vitroPropertyGroupbibobscure
prohibited from update below role level annot: public
public description annot: The Open Access mandate URI

access type
type: DatatypeProperty
sub property of: topDataProperty
domain: Document
range: string
IAO_0000112: Open access, subscription
IAO_0000115: The publication's access type
hidden from display below role level annot: public
hidden from publish below role level annot: public
in property group annot: vitroPropertyGroupbibobscure
prohibited from update below role level annot: public
public description annot: The publication's access type

aggregator
type: DatatypeProperty
sub property of: topDataProperty
domain: Journal
range: string
IAO_0000115: The journal aggregator
hidden from display below role level annot: public
hidden from publish below role level annot: public
in property group annot: vitroPropertyGroupbibobscure
prohibited from update below role level annot: public
public description annot: The journal aggregator

allow unrestricted reuse BOAI
type: DatatypeProperty
sub property of: topDataProperty
domain: Journal
range: string
IAO_0000115: Whether the journal allows unrestricted reuse of its contents under the Budapest Open Access Initiative
hidden from display below role level annot: public
hidden from publish below role level annot: public
in property group annot: vitroPropertyGroupbibobscure
prohibited from update below role level annot: public
public description annot: Whether the journal allows unrestricted reuse of its contents under the Budapest Open Access Initiative

APC amount
type: DatatypeProperty
sub property of: hasMonetaryAmount
sub property of: topDataProperty
domain: Journal
range: string
IAO_0000115: The article processing charge for the journal
hidden from display below role level annot: public
hidden from publish below role level annot: public
in property group annot: vitroPropertyGroupbibobscure
prohibited from update below role level annot: public
public description annot: The article processing charge for the journal

APC currency
type: DatatypeProperty
sub property of: hasCurrency
sub property of: topDataProperty
domain: Journal
range: string
IAO_0000115: The currency for the journal article processing charge
hidden from display below role level annot: public
hidden from publish below role level annot: public
in property group annot: vitroPropertyGroupbibobscure
prohibited from update below role level annot: public
public description annot: The currency for the journal article processing charge

BDTD identifier
type: DatatypeProperty
sub property of: identifier
sub property of: topDataProperty
domain: Document
range: string
IAO_0000115: The publication's identifier in the BDTD (Biblioteca Digital de Teses e Dissertações) platform
hidden from display below role level annot: public
hidden from publish below role level annot: public
in property group annot: vitroPropertyGroupidentifiers
prohibited from update below role level annot: public
public description annot: The publication's identifier in the BDTD (Biblioteca Digital de Teses e Dissertações) platform

BrCris identifier
type: DatatypeProperty
sub property of: identifier
sub property of: topDataProperty
range: string
IAO_0000115: The entity's BrCris identifier
hidden from display below role level annot: public
hidden from publish below role level annot: public
in property group annot: vitroPropertyGroupidentifiers
prohibited from update below role level annot: public
public description annot: The entity's BrCris identifier

call abbreviation
type: DatatypeProperty
sub property of: abbreviation
sub property of: topDataProperty
domain: Project
range: string
IAO_0000115: The abbreviation of the call for projects that contemplated the project.
hidden from display below role level annot: public
hidden from publish below role level annot: public
in property group annot: vitroPropertyGroupoverview
prohibited from update below role level annot: public
public description annot: The abbreviation of the call for projects that contemplated the project.

call name
type: DatatypeProperty
sub property of: topDataProperty
IAO_0000115: The name of the call for projects that contemplated the project.
hidden from display below role level annot: public
hidden from publish below role level annot: public
in property group annot: vitroPropertyGroupoverview
prohibited from update below role level annot: public
public description annot: The name of the call for projects that contemplated the project.

Capes identifier
type: DatatypeProperty
sub property of: identifier
sub property of: topDataProperty
range: string
IAO_0000115: The entity's identifier attributed by Capes
hidden from display below role level annot: public
hidden from publish below role level annot: public
in property group annot: vitroPropertyGroupidentifiers
prohibited from update below role level annot: public
public description annot: The entity's identifier attributed by Capes

Ciencia id
type: DatatypeProperty
sub property of: identifier
sub property of: topDataProperty
domain: Person
range: string
IAO_0000115: The person's ciencia id
hidden from display below role level annot: public
hidden from publish below role level annot: public
in property group annot: vitroPropertyGroupidentifiers
prohibited from update below role level annot: public
public description annot: The person's ciencia id

circulation
type: DatatypeProperty
sub property of: topDataProperty
domain: Journal
range: string
IAO_0000115: The journal circulation
hidden from display below role level annot: public
hidden from publish below role level annot: public
in property group annot: vitroPropertyGroupbibobscure
prohibited from update below role level annot: public
public description annot: The journal circulation

citation name
type: DatatypeProperty
sub property of: topDataProperty
domain: Name
range: string
IAO_0000115: The person's citation name, as it appears in publications and bibliographic references
hidden from display below role level annot: public
hidden from publish below role level annot: public
in property group annot: vitroPropertyGroupaddress
prohibited from update below role level annot: public
public description annot: The person's citation name

CNPJ number
type: DatatypeProperty
sub property of: identifier
sub property of: topDataProperty
domain: Organization
range: string
IAO_0000115: The organization's CNPJ number
hidden from display below role level annot: public
hidden from publish below role level annot: public
in property group annot: vitroPropertyGroupidentifiers
prohibited from update below role level annot: public
public description annot: The organization's CNPJ number

CNPq identifier
type: DatatypeProperty
sub property of: identifier
sub property of: topDataProperty
range: string
IAO_0000115: The identifier of the organization assigned by CNPq
hidden from display below role level annot: public
hidden from publish below role level annot: public
in property group annot: vitroPropertyGroupidentifiers
prohibited from update below role level annot: public
public description annot: The identifier of the organization assigned by CNPq

compatibility
type: DatatypeProperty
sub property of: topDataProperty
domain: Journal
range: string
IAO_0000115: The journal compatibility information
hidden from display below role level annot: public
hidden from publish below role level annot: public
in property group annot: vitroPropertyGroupbibobscure
prohibited from update below role level annot: public
public description annot: The journal compatibility information

copyright without restrictions
type: DatatypeProperty
sub property of: topDataProperty
domain: Journal
range: string
IAO_0000115: Whether the journal provides copyright without restrictions for articles
hidden from display below role level annot: public
hidden from publish below role level annot: public
in property group annot: vitroPropertyGroupbibobscure
prohibited from update below role level annot: public
public description annot: Whether the journal provides copyright without restrictions for articles

country code
type: DatatypeProperty
sub property of: topDataProperty
domain: Patent
range: string
IAO_0000115: The code of the country where the patent was filed.
hidden from display below role level annot: public
hidden from publish below role level annot: public
in property group annot: vitroPropertyGroupoverview
prohibited from update below role level annot: public
public description annot: The code of the country where the patent was filed.

coverage
type: DatatypeProperty
sub property of: topDataProperty
domain: Document
range: string
IAO_0000115: The publication's coverage
hidden from display below role level annot: public
hidden from publish below role level annot: public
in property group annot: vitroPropertyGroupbibobscure
prohibited from update below role level annot: public
public description annot: The publication's coverage

CPC classification
type: DatatypeProperty
sub property of: topDataProperty
domain: Patent
range: string
IAO_0000115: The classification of the patent according to the Cooperative Patent Classification.
hidden from display below role level annot: public
hidden from publish below role level annot: public
in property group annot: vitroPropertyGroupoverview
prohibited from update below role level annot: public
public description annot: The classification of the patent according to the Cooperative Patent Classification.

CPF number
type: DatatypeProperty
sub property of: identifier
sub property of: topDataProperty
type: FunctionalProperty
domain: Person
range: string
IAO_0000115: The person's CPF (Cadastro de Pessoa Física) number
hidden from display below role level annot: public
hidden from publish below role level annot: public
in property group annot: vitroPropertyGroupidentifiers
prohibited from update below role level annot: public
public description annot: The person's CPF (Cadastro de Pessoa Física) number

decimal classification
type: DatatypeProperty
sub property of: topDataProperty
domain: Journal
range: string
IAO_0000115: The journal decimal classification
hidden from display below role level annot: public
hidden from publish below role level annot: public
in property group annot: vitroPropertyGroupoverview
prohibited from update below role level annot: public
public description annot: The journal decimal classification

degree level
type: DatatypeProperty
sub property of: topDataProperty
domain: Course
range: string
IAO_0000112: Undergraduate, master, doctoral
IAO_0000115: The course's degree level
hidden from display below role level annot: public
hidden from publish below role level annot: public
in property group annot: vitroPropertyGroupoverview
prohibited from update below role level annot: public
public description annot: The course's degree level

deposit policy directory
type: DatatypeProperty
sub property of: topDataProperty
domain: Journal
range: string
IAO_0000115: The journal deposit policy directory
hidden from display below role level annot: public
hidden from publish below role level annot: public
in property group annot: vitroPropertyGroupbibobscure
prohibited from update below role level annot: public
public description annot: The journal deposit policy directory

Diadorim access rights
type: DatatypeProperty
sub property of: topDataProperty
domain: Journal
range: string
IAO_0000115: The journal access rights in the Diadorim platform
hidden from display below role level annot: public
hidden from publish below role level annot: public
in property group annot: vitroPropertyGroupbibobscure
prohibited from update below role level annot: public
public description annot: The journal access rights in the Diadorim platform

Diadorim identifier
type: DatatypeProperty
sub property of: identifier
sub property of: topDataProperty
domain: Journal
range: string
IAO_0000115: The journal identifier in the Diadorim platform
hidden from display below role level annot: public
hidden from publish below role level annot: public
in property group annot: vitroPropertyGroupidentifiers
prohibited from update below role level annot: public
public description annot: The journal identifier in the Diadorim platform

digital archiving policy
type: DatatypeProperty
sub property of: topDataProperty
domain: Journal
range: string
IAO_0000115: The journal digital archiving policy
hidden from display below role level annot: public
hidden from publish below role level annot: public
in property group annot: vitroPropertyGroupbibobscure
prohibited from update below role level annot: public
public description annot: The journal digital archiving policy

distribution routes
type: DatatypeProperty
sub property of: topDataProperty
domain: Journal
range: string
IAO_0000115: The journal distribution routes
hidden from display below role level annot: public
hidden from publish below role level annot: public
in property group annot: vitroPropertyGroupbibobscure
prohibited from update below role level annot: public
public description annot: The journal distribution routes

distribution type
type: DatatypeProperty
sub property of: topDataProperty
domain: Journal
range: string
IAO_0000115: The journal distribution type
hidden from display below role level annot: public
hidden from publish below role level annot: public
in property group annot: vitroPropertyGroupbibobscure
prohibited from update below role level annot: public
public description annot: The journal distribution type

duration
type: DatatypeProperty
sub property of: topDataProperty
domain: Grant
range: string
IAO_0000115: The grant's time duration
hidden from display below role level annot: public
hidden from publish below role level annot: public
prohibited from update below role level annot: public
public description annot: The grant's time duration

embargoed time
type: DatatypeProperty
sub property of: topDataProperty
domain: Journal
range: string
IAO_0000115: The embargo time for articles published in the journal
hidden from display below role level annot: public
hidden from publish below role level annot: public
in property group annot: vitroPropertyGroupbibobscure
prohibited from update below role level annot: public
public description annot: The embargo time for articles published in the journal

Espacenet abstract
type: DatatypeProperty
sub property of: abstract
sub property of: topDataProperty
domain: Patent
range: string
IAO_0000115: The patent abstract in the Espacenet platform.
hidden from display below role level annot: public
hidden from publish below role level annot: public
in property group annot: vitroPropertyGroupoverview
prohibited from update below role level annot: public
public description annot: The patent abstract in the Espacenet platform.

Espacenet number
type: DatatypeProperty
sub property of: identifier
sub property of: topDataProperty
domain: Patent
range: string
IAO_0000115: The patent number in the Espacenet platform.
hidden from display below role level annot: public
hidden from publish below role level annot: public
in property group annot: vitroPropertyGroupidentifiers
prohibited from update below role level annot: public
public description annot: The patent number in the Espacenet platform.

Espacenet title
type: DatatypeProperty
sub property of: topDataProperty
domain: Patent
range: string
IAO_0000115: The patent title in the Espacenet platform.
hidden from display below role level annot: public
hidden from publish below role level annot: public
in property group annot: vitroPropertyGroupoverview
prohibited from update below role level annot: public
public description annot: The patent title in the Espacenet platform.

full text formats
type: DatatypeProperty
sub property of: topDataProperty
domain: Journal
range: string
IAO_0000115: The format of full texts provided by this journal
hidden from display below role level annot: public
hidden from publish below role level annot: public
in property group annot: vitroPropertyGroupbibobscure
prohibited from update below role level annot: public
public description annot: The format of full texts provided by this journal

FundRef identifier
type: DatatypeProperty
sub property of: identifier
sub property of: topDataProperty
domain: Organization
range: string
IAO_0000115: The identifier of the organization in the FundRef funders list
hidden from display below role level annot: public
hidden from publish below role level annot: public
in property group annot: vitroPropertyGroupidentifiers
prohibited from update below role level annot: public
public description annot: The identifier of the organization in the FundRef funders list

geographic distribution
type: DatatypeProperty
sub property of: topDataProperty
domain: Journal
range: string
IAO_0000115: The journal geographic distribution
hidden from display below role level annot: public
hidden from publish below role level annot: public
in property group annot: vitroPropertyGroupbibobscure
prohibited from update below role level annot: public
public description annot: The journal geographic distribution

GRID identifier
type: DatatypeProperty
sub property of: identifier
sub property of: topDataProperty
domain: Organization
range: string
IAO_0000115: The identifier of the organization in the Global Research Identifier Database (GRID)
hidden from display below role level annot: public
hidden from publish below role level annot: public
in property group annot: vitroPropertyGroupidentifiers
prohibited from update below role level annot: public
public description annot: The identifier of the organization in the Global Research Identifier Database (GRID)

handle identifier
type: DatatypeProperty
sub property of: identifier
sub property of: topDataProperty
domain: Document
range: string
IAO_0000115: The publication's handle identifier
hidden from display below role level annot: public
hidden from publish below role level annot: public
in property group annot: vitroPropertyGroupidentifiers
prohibited from update below role level annot: public
public description annot: The publication's handle identifier

Inep identifier
type: DatatypeProperty
sub property of: identifier
sub property of: topDataProperty
range: string
IAO_0000115: The identifier of the organization assigned by the Instituto Nacional de Estudos e Pesquisas Educacionais Anísio Teixeira (Inep)
hidden from display below role level annot: public
hidden from publish below role level annot: public
in property group annot: vitroPropertyGroupidentifiers
prohibited from update below role level annot: public
public description annot: The identifier of the organization assigned by the Instituto Nacional de Estudos e Pesquisas Educacionais Anísio Teixeira (Inep)

IPC classification
type: DatatypeProperty
sub property of: topDataProperty
domain: Patent
range: string
IAO_0000115: The classification of the patent according to the International Patent Classification.
hidden from display below role level annot: public
hidden from publish below role level annot: public
in property group annot: vitroPropertyGroupoverview
prohibited from update below role level annot: public
public description annot: The classification of the patent according to the International Patent Classification.

ISI number
type: DatatypeProperty
sub property of: identifier
sub property of: topDataProperty
domain: Document
range: string
IAO_0000115: The publication's identifier in the ISI (International Scientific Indexing) platform
hidden from display below role level annot: public
hidden from publish below role level annot: public
in property group annot: vitroPropertyGroupidentifiers
prohibited from update below role level annot: public
public description annot: The publication's identifier in the ISI (International Scientific Indexing) platform

ISNI
type: DatatypeProperty
sub property of: identifier
sub property of: topDataProperty
domain: Organization
range: string
IAO_0000115: The organization's International Standard Name Identifier (ISNI)
hidden from display below role level annot: public
hidden from publish below role level annot: public
in property group annot: vitroPropertyGroupidentifiers
prohibited from update below role level annot: public
public description annot: The organization's International Standard Name Identifier (ISNI)

ISSN-L
type: DatatypeProperty
sub property of: identifier
sub property of: topDataProperty
domain: Journal
range: string
IAO_0000115: The journal linking ISSN. The linking ISSN, or ISSN-L, is a specific ISSN that groups the different media of the same serial publication. A single ISSN-L is designated for all media of a serial publication, irrespective of how many there are. A serial publication is associated with a single ISSN-L.
hidden from display below role level annot: public
hidden from publish below role level annot: public
in property group annot: vitroPropertyGroupidentifiers
prohibited from update below role level annot: public
public description annot: The journal linking ISSN (ISSN-L)

journal status
type: DatatypeProperty
sub property of: topDataProperty
domain: Journal
range: string
IAO_0000115: The journal status
hidden from display below role level annot: public
hidden from publish below role level annot: public
in property group annot: vitroPropertyGroupoverview
prohibited from update below role level annot: public
public description annot: The journal status

Latindex identifier
type: DatatypeProperty
sub property of: identifier
sub property of: topDataProperty
domain: Journal
range: string
IAO_0000115: The journal identifier in the Latindex platform
hidden from display below role level annot: public
hidden from publish below role level annot: public
in property group annot: vitroPropertyGroupidentifiers
prohibited from update below role level annot: public
public description annot: The journal identifier in the Latindex platform

Lattes abstract
type: DatatypeProperty
sub property of: abstract
sub property of: topDataProperty
domain: Patent
range: string
IAO_0000115: The patent abstract in the Lattes platform.
hidden from display below role level annot: public
hidden from publish below role level annot: public
in property group annot: vitroPropertyGroupoverview
prohibited from update below role level annot: public
public description annot: The patent abstract in the Lattes platform.

Lattes identifier
type: DatatypeProperty
sub property of: identifier
sub property of: topDataProperty
domain: Person
range: string
IAO_0000115: The person's identifier in the Lattes platform
hidden from display below role level annot: public
hidden from publish below role level annot: public
in property group annot: vitroPropertyGroupidentifiers
prohibited from update below role level annot: public
public description annot: The person's identifier in the Lattes platform

Lattes number
type: DatatypeProperty
sub property of: identifier
sub property of: topDataProperty
domain: Patent
range: string
IAO_0000115: The patent number in the Lattes platform.
hidden from display below role level annot: public
hidden from publish below role level annot: public
in property group annot: vitroPropertyGroupidentifiers
prohibited from update below role level annot: public
public description annot: The patent number in the Lattes platform.

Lattes short identifier
type: DatatypeProperty
sub property of: identifier
sub property of: topDataProperty
domain: Person
range: string
IAO_0000115: The person's short identifier in the Lattes platform
hidden from display below role level annot: public
hidden from publish below role level annot: public
in property group annot: vitroPropertyGroupidentifiers
prohibited from update below role level annot: public
public description annot: The person's short identifier in the Lattes platform

Lattes title
type: DatatypeProperty
sub property of: topDataProperty
domain: Patent
range: string
IAO_0000115: The patent title in the Lattes platform.
hidden from display below role level annot: public
hidden from publish below role level annot: public
in property group annot: vitroPropertyGroupoverview
prohibited from update below role level annot: public
public description annot: The patent title in the Lattes platform.

license attributes
type: DatatypeProperty
sub property of: topDataProperty
domain: Journal
range: string
IAO_0000115: The journal license attributes
hidden from display below role level annot: public
hidden from publish below role level annot: public
in property group annot: vitroPropertyGroupbibobscure
prohibited from update below role level annot: public
public description annot: The journal license attributes

MEC Identifier
type: DatatypeProperty
sub property of: identifier
sub property of: topDataProperty
range: string
IAO_0000115: The identifier of the organization assigned by the Brazilian Ministry of Education and Culture (MEC)
hidden from display below role level annot: public
hidden from publish below role level annot: public
in property group annot: vitroPropertyGroupidentifiers
prohibited from update below role level annot: public
public description annot: The identifier of the organization assigned by the Brazilian Ministry of Education and Culture (MEC)

modality code
type: DatatypeProperty
sub property of: topDataProperty
domain: Project
range: string
IAO_0000115: The code for the project's modality according to the CNPq classification
hidden from display below role level annot: public
hidden from publish below role level annot: public
in property group annot: vitroPropertyGroupoverview
prohibited from update below role level annot: public
public description annot: The code for the project's modality according to the CNPq classification

modality name
type: DatatypeProperty
sub property of: topDataProperty
domain: Project
range: string
IAO_0000115: The name of the project's modality according to the CNPq classification.
hidden from display below role level annot: public
hidden from publish below role level annot: public
in property group annot: vitroPropertyGroupoverview
prohibited from update below role level annot: public
public description annot: The name of the project's modality according to the CNPq classification.

national archiving
type: DatatypeProperty
sub property of: topDataProperty
domain: Journal
range: string
IAO_0000115: The journal national archiving information
hidden from display below role level annot: public
hidden from publish below role level annot: public
in property group annot: vitroPropertyGroupbibobscure
prohibited from update below role level annot: public
public description annot: The journal national archiving information

neighborhood
type: DatatypeProperty
sub property of: topDataProperty
domain: Address
range: string
IAO_0000115: The address neighborhood
hidden from display below role level annot: public
hidden from publish below role level annot: public
in property group annot: vitroPropertyGrouplocation
prohibited from update below role level annot: public
public description annot: The address neighborhood

notes
type: DatatypeProperty
sub property of: topDataProperty
range: string
IAO_0000115: Any additional notes on the resource
hidden from display below role level annot: public
hidden from publish below role level annot: public
in property group annot: vitroPropertyGroupbibobscure
prohibited from update below role level annot: public
public description annot: Any additional notes on the resource

OAI identifier
type: DatatypeProperty
sub property of: identifier
sub property of: topDataProperty
domain: Journal
range: string
IAO_0000115: The Open Archives Initiative identifier for the journal
hidden from display below role level annot: public
hidden from publish below role level annot: public
in property group annot: vitroPropertyGroupidentifiers
prohibited from update below role level annot: public
public description annot: The Open Archives Initiative identifier for the journal

OAI-PMH url
type: DatatypeProperty
sub property of: topDataProperty
sub property of: url
range: anyURI
IAO_0000115: The resource OAI-PMH protocol URL
hidden from display below role level annot: public
hidden from publish below role level annot: public
in property group annot: vitroPropertyGroupbibobscure
prohibited from update below role level annot: public
public description annot: The resource OAI-PMH protocol URL

Oasisbr identifier
type: DatatypeProperty
sub property of: identifier
sub property of: topDataProperty
domain: Document
range: string
IAO_0000115: The publication's identifier in the OasisBr platform
hidden from display below role level annot: public
hidden from publish below role level annot: public
in property group annot: vitroPropertyGroupidentifiers
prohibited from update below role level annot: public
public description annot: The publication's identifier in the OasisBr platform

old title
type: DatatypeProperty
sub property of: topDataProperty
domain: Journal
range: string
IAO_0000115: The journal former title, in case it has changed over time
hidden from display below role level annot: public
hidden from publish below role level annot: public
in property group annot: vitroPropertyGroupbibobscure
prohibited from update below role level annot: public
public description annot: The journal former title, in case it has changed over time

OpenDOAR identifier
type: DatatypeProperty
sub property of: identifier
sub property of: topDataProperty
domain: Journal
range: string
IAO_0000115: The journal identifier in the OpenDOAR platform
hidden from display below role level annot: public
hidden from publish below role level annot: public
in property group annot: vitroPropertyGroupidentifiers
prohibited from update below role level annot: public
public description annot: The journal identifier in the OpenDOAR platform

nature
type: DatatypeProperty
sub property of: topDataProperty
domain: Organization
range: string
IAO_0000115: The organization's nature
hidden from display below role level annot: public
hidden from publish below role level annot: public
in property group annot: vitroPropertyGroupoverview
prohibited from update below role level annot: public
public description annot: The organization's nature

OrgRef identifier
type: DatatypeProperty
sub property of: identifier
sub property of: topDataProperty
domain: Organization
range: string
IAO_0000115: The identifier of the organization in the OrgRef database
hidden from display below role level annot: public
hidden from publish below role level annot: public
in property group annot: vitroPropertyGroupidentifiers
prohibited from update below role level annot: public
public description annot: The identifier of the organization in the OrgRef database

pos-print deposit
type: DatatypeProperty
sub property of: topDataProperty
domain: Journal
range: string
IAO_0000115: The journal pos-print deposit
hidden from display below role level annot: public
hidden from publish below role level annot: public
in property group annot: vitroPropertyGroupbibobscure
prohibited from update below role level annot: public
public description annot: The journal pos-print deposit

process number
type: DatatypeProperty
sub property of: identifier
sub property of: topDataProperty
domain: Project
range: string
IAO_0000115: The number that identifies the process associated with the project, opened and managed by the funding agency that funds it.
hidden from display below role level annot: public
hidden from publish below role level annot: public
in property group annot: vitroPropertyGroupoverview
prohibited from update below role level annot: public
public description annot: The number that identifies the process associated with the project, opened and managed by the funding agency that funds it.

project status
type: DatatypeProperty
sub property of: topDataProperty
domain: Project
range: string
IAO_0000115: The status of the project
hidden from display below role level annot: public
hidden from publish below role level annot: public
in property group annot: vitroPropertyGroupoverview
prohibited from update below role level annot: public
public description annot: The status of the project

publication format
type: DatatypeProperty
sub property of: topDataProperty
domain: Journal
range: string
IAO_0000115: The journal publication format
hidden from display below role level annot: public
hidden from publish below role level annot: public
in property group annot: vitroPropertyGroupbibobscure
prohibited from update below role level annot: public
public description annot: The journal publication format

publication frequency
type: DatatypeProperty
sub property of: topDataProperty
domain: Journal
range: string
IAO_0000115: The journal publication periodicity
hidden from display below role level annot: public
hidden from publish below role level annot: public
in property group annot: vitroPropertyGroupoverview
prohibited from update below role level annot: public
public description annot: The journal publication periodicity

publication rights without restrictions
type: DatatypeProperty
sub property of: topDataProperty
domain: Journal
range: string
IAO_0000115: Whether the journal provides publication rights without restrictions for articles
hidden from display below role level annot: public
hidden from publish below role level annot: public
in property group annot: vitroPropertyGroupbibobscure
prohibited from update below role level annot: public
public description annot: Whether the journal provides publication rights without restrictions for articles

review process
type: DatatypeProperty
sub property of: topDataProperty
domain: Journal
range: string
IAO_0000115: The review process for the articles submitted to this journal
hidden from display below role level annot: public
hidden from publish below role level annot: public
in property group annot: vitroPropertyGroupbibobscure
prohibited from update below role level annot: public
public description annot: The review process for the articles submitted to this journal

rights time
type: DatatypeProperty
sub property of: topDataProperty
domain: Journal
range: string
IAO_0000115: The rights time for articles published in this journal
hidden from display below role level annot: public
hidden from publish below role level annot: public
in property group annot: vitroPropertyGroupbibobscure
prohibited from update below role level annot: public
public description annot: The rights time for articles published in this journal

ROR identifier
type: DatatypeProperty
sub property of: identifier
sub property of: topDataProperty
domain: Organization
range: string
IAO_0000115: The identifier of the organization in the Research Organization Registry (ROR) project
hidden from display below role level annot: public
hidden from publish below role level annot: public
in property group annot: vitroPropertyGroupidentifiers
prohibited from update below role level annot: public
public description annot: The identifier of the organization in the Research Organization Registry (ROR) project

identifier in scheme
type: DatatypeProperty
sub property of: topDataProperty
domain: Concept
range: string
IAO_0000115: The identifier of the concept inside the scheme it belongs to.
hidden from display below role level annot: public
hidden from publish below role level annot: public
in property group annot: vitroPropertyGroupidentifiers
prohibited from update below role level annot: public
public description annot: The identifier of the concept inside the scheme it belongs to.

SCP number
type: DatatypeProperty
sub property of: identifier
sub property of: topDataProperty
domain: Document
range: string
IAO_0000115: The publication's Scopus number
hidden from display below role level annot: public
hidden from publish below role level annot: public
in property group annot: vitroPropertyGroupidentifiers
prohibited from update below role level annot: public
public description annot: The publication's Scopus number

series
type: DatatypeProperty
sub property of: topDataProperty
domain: Document
range: string
IAO_0000115: The publication's series
hidden from display below role level annot: public
hidden from publish below role level annot: public
in property group annot: vitroPropertyGroupbibobscure
prohibited from update below role level annot: public
public description annot: The publication's series

source type
type: DatatypeProperty
sub property of: type
sub property of: topDataProperty
domain: ERO_0000005
range: string
IAO_0000115: The service's source type
hidden from display below role level annot: public
hidden from publish below role level annot: public
in property group annot: vitroPropertyGroupoverview
prohibited from update below role level annot: public
public description annot: The service's source type

submission amount
type: DatatypeProperty
sub property of: hasMonetaryAmount
sub property of: topDataProperty
domain: Journal
range: string
IAO_0000115: The amount charged by the journal for article submission
hidden from display below role level annot: public
hidden from publish below role level annot: public
in property group annot: vitroPropertyGroupbibobscure
prohibited from update below role level annot: public
public description annot: The amount charged by the journal for article submission

submission url
type: DatatypeProperty
sub property of: topDataProperty
sub property of: url
domain: Journal
range: anyURI
IAO_0000115: The journal article submission URL
hidden from display below role level annot: public
hidden from publish below role level annot: public
in property group annot: vitroPropertyGroupoverview
prohibited from update below role level annot: public
public description annot: The journal article submission URL

subtitle
type: DatatypeProperty
sub property of: topDataProperty
domain: Document
range: string
IAO_0000115: The publication's subtitle
hidden from display below role level annot: public
hidden from publish below role level annot: public
in property group annot: vitroPropertyGroupoverview
prohibited from update below role level annot: public
public description annot: The publication's subtitle

time to publication
type: DatatypeProperty
sub property of: topDataProperty
domain: Journal
range: string
IAO_0000115: The mean time from submission to publication in the journal
hidden from display below role level annot: public
hidden from publish below role level annot: public
in property group annot: vitroPropertyGroupbibobscure
prohibited from update below role level annot: public
public description annot: The mean time from submission to publication in the journal

total recorded articles
type: DatatypeProperty
sub property of: topDataProperty
domain: Journal
range: integer
IAO_0000115: The journal total number of recorded articles
hidden from display below role level annot: public
hidden from publish below role level annot: public
in property group annot: vitroPropertyGroupoverview
prohibited from update below role level annot: public
public description annot: The journal total number of recorded articles

Ulrichsweb identifier
type: DatatypeProperty
sub property of: identifier
sub property of: topDataProperty
domain: Journal
range: string
IAO_0000115: The journal identifier in the Ulrichsweb platform
hidden from display below role level annot: public
hidden from publish below role level annot: public
in property group annot: vitroPropertyGroupidentifiers
prohibited from update below role level annot: public
public description annot: The journal identifier in the Ulrichsweb platform

URI identifier
type: DatatypeProperty
sub property of: identifier
sub property of: topDataProperty
domain: Journal
range: string
IAO_0000115: The URI as an identifier for the journal
hidden from display below role level annot: public
hidden from publish below role level annot: public
in property group annot: vitroPropertyGroupidentifiers
prohibited from update below role level annot: public
public description annot: The URI as an identifier for the journal

uses
type: DatatypeProperty
sub property of: topDataProperty
domain: Project
range: string
hidden from display below role level annot: public
hidden from publish below role level annot: public
in property group annot: vitroPropertyGroupresearch
prohibited from update below role level annot: public

Wikidata identifier
type: DatatypeProperty
sub property of: identifier
sub property of: topDataProperty
domain: Organization
range: string
IAO_0000115: The identifier of the organization in the Wikidata platform
hidden from display below role level annot: public
hidden from publish below role level annot: public
in property group annot: vitroPropertyGroupidentifiers
prohibited from update below role level annot: public
public description annot: The identifier of the organization in the Wikidata platform

Community
type: Class
subclass of: BFO_0000001
subclass of: BFO_0000002
subclass of: BFO_0000004
subclass of: Agent
subclass of: Group
IAO_0000115: A community of people related by a common topic
description annot: A community of people and the entities related to them (Organizations, Publications, Projects, etc.) grouped according to a topic shared among them
display limit annot: -1
display rank annot: -1
hidden from display below role level annot: public
hidden from publish below role level annot: public
in class group: vitroClassGrouporganizations
prohibited from update below role level annot: public

Graduate Program
type: Class
subclass of: BFO_0000001
subclass of: BFO_0000002
subclass of: BFO_0000004
subclass of: Program
subclass of: Agent
subclass of: Organization
IAO_0000115: A program offering graduate courses inside an educational institution
description annot: A program offering graduate courses inside an educational institution
display limit annot: -1
display rank annot: -1
hidden from display below role level annot: public
hidden from publish below role level annot: public
in class group: vitroClassGrouporganizations
prohibited from update below role level annot: public

Referee Role
type: Class
subclass of: BFO_0000001
subclass of: BFO_0000002
subclass of: BFO_0000017
subclass of: BFO_0000020
subclass of: BFO_0000023
IAO_0000115: The role assumed by a person participating in a thesis evaluation committee
description annot: The role assumed by a person participating in a thesis evaluation committee
display limit annot: -1
display rank annot: -1
hidden from display below role level annot: public
hidden from publish below role level annot: public
prohibited from update below role level annot: public